Target
HIV-1 protease
Ligand
BDBM518
Substrate
Meas. Tech.
Protease Inhibtion Assay
pH
5.5±0
Ki
0.530±0.18 nM
Citation
 Rodgers, JDLam, PYJohnson, BLWang, HLi, RRu, YKo, SSSeitz, SPTrainor, GLAnderson, PSKlabe, RMBacheler, LTCordova, BGarber, SReid, CWright, MRChang, CHErickson-Viitanen, S Design and selection of DMP 850 and DMP 851: the next generation of cyclic urea HIV protease inhibitors. Chem Biol 5:597-608 (1998)  
Target
Name:
HIV-1 protease
Synonyms:
HIV-1 protease wild type
Type:
Protein
Mol. Mass.:
10757.68
Organism:
Human immunodeficiency virus
Description:
O90785
Residue:
99
  
Inhibitor
Name:
BDBM518
Synonyms:
(3S,4aS,8aS)-N-tert-butyl-2-[(2R,3R)-2-hydroxy-3-[(3-hydroxy-2-methylphenyl)formamido]-4-(phenylsulfanyl)butyl]-decahydroisoquinoline-3-carboxamide CHEMBL584 Viracept
Type:
Small organic molecule
Emp. Form.:
C32H45N3O4S
Mol. Mass.:
567.782
SMILES:
Cc1c(O)cccc1C(=O)N[C@@H](CSc1ccccc1)[C@H](O)CN1C[C@H]2CCCC[C@H]2C[C@H]1C(=O)NC(C)(C)C
: