Target
Receptor-interacting serine/threonine-protein kinase 1
Ligand
BDBM6866
Substrate
Meas. Tech.
Kinase Inhibitor Selectivity Profiling Assay
Kd
1800±n/a nM
Citation
 PubChem, PC Kinase Inhibitor Selectivity Profiling Assay PubChem Bioassay (2008)[AID] 
Target
Name:
Receptor-interacting serine/threonine-protein kinase 1
Synonyms:
Cell death protein RIP RIP-1 RIPK1 Receptor-interacting protein 1
Type:
Enzyme Catalytic Domain
Mol. Mass.:
75926.99
Organism:
Homo sapiens (Human)
Description:
Q13546
Residue:
671
  
Inhibitor
Name:
BDBM6866
Synonyms:
1-Acyl-1H-[1,2,4]triazole-3,5-diamine Analogue 3b 4-[[5-Amino-1-(2,6-difluorobenzoyl)-1H-1,2,4-triazol-3-yl]amino]-benzenesulfonamide JNJ-7706621 | cid_5330790
Type:
Small organic molecule
Emp. Form.:
C15H12F2N6O3S
Mol. Mass.:
394.356
SMILES:
Nc1nc(Nc2ccc(cc2)S(N)(=O)=O)nn1C(=O)c1c(F)cccc1F
: