Target
STE20-like serine/threonine-protein kinase
Ligand
BDBM21079
Substrate
Meas. Tech.
Kinase Inhibitor Selectivity Profiling Assay
Kd
450±n/a nM
Citation
 PubChem, PC Kinase Inhibitor Selectivity Profiling Assay PubChem Bioassay (2008)[AID] 
Target
Name:
STE20-like serine/threonine-protein kinase
Synonyms:
KIAA0204 SLK_HUMAN Serine/threonine-protein kinase 2
Type:
PROTEIN
Mol. Mass.:
142644.38
Organism:
Homo sapiens (Human)
Description:
ChEMBL_1451342
Residue:
1235
  
Inhibitor
Name:
BDBM21079
Synonyms:
1-[4-(3-amino-1H-indazol-4-yl)phenyl]-3-(2-fluoro-5-methyl-phenyl)urea 1-[4-(3-azanyl-1H-indazol-4-yl)phenyl]-3-(2-fluoranyl-5-methyl-phenyl)urea ABT-869 CHEMBL223360 | cid_11485656
Type:
Small organic molecule
Emp. Form.:
C21H18FN5O
Mol. Mass.:
375.3989
SMILES:
Cc1ccc(F)c(NC(=O)Nc2ccc(cc2)-c2cccc3[nH]nc(N)c23)c1
: