Target
STE20-like serine/threonine-protein kinase
Ligand
BDBM5447
Substrate
Meas. Tech.
Kinase Inhibitor Selectivity Profiling Assay
Kd
920±n/a nM
Citation
 PubChem, PC Kinase Inhibitor Selectivity Profiling Assay PubChem Bioassay (2008)[AID] 
Target
Name:
STE20-like serine/threonine-protein kinase
Synonyms:
KIAA0204 SLK_HUMAN Serine/threonine-protein kinase 2
Type:
PROTEIN
Mol. Mass.:
142644.38
Organism:
Homo sapiens (Human)
Description:
ChEMBL_1451342
Residue:
1235
  
Inhibitor
Name:
BDBM5447
Synonyms:
CHEMBL939 Iressa N-(3-chloro-4-fluorophenyl)-7-methoxy-6-[3-(morpholin-4-yl)propoxy]quinazolin-4-amine US10507209, Compound Gefitinib US9730934, Gefitinib WO2022090481, Example gefitinib cid_123631
Type:
Small organic molecule
Emp. Form.:
C22H24ClFN4O3
Mol. Mass.:
446.902
SMILES:
COc1cc2ncnc(Nc3ccc(F)c(Cl)c3)c2cc1OCCCN1CCOCC1
: