Target
Thymidylate synthase
Ligand
BDBM36702
Substrate
Meas. Tech.
Enzyme Assay
pH
7.4±0
Temperature
293.15±0 K
IC50
4.7e+3±n/a nM
Citation
 Tondi, DSlomczynska, UCosti, MPWatterson, DMGhelli, SShoichet, BK Structure-based discovery and in-parallel optimization of novel competitive inhibitors of thymidylate synthase. Chem Biol 6:319-31 (1999)  
Target
Name:
Thymidylate synthase
Synonyms:
TSase Thymidylate Synthase (TS) thyA
Type:
Enzyme
Mol. Mass.:
36576.54
Organism:
Lactobacillus casei
Description:
Residue:
316
  
Inhibitor
Name:
BDBM36702
Synonyms:
Dansyltyrosine deriviative 20B
Type:
Small organic molecule
Emp. Form.:
C31H28N2O7S2
Mol. Mass.:
604.693
SMILES:
CN(C)c1cccc2c(cccc12)S(=O)(=O)Oc1ccc(C[C@H](NS(=O)(=O)c2ccc3ccccc3c2)C(O)=O)cc1
: