Target
Dimer of Gag-Pol polyprotein [489-587]
Ligand
BDBM1225
Substrate
HIV Protease Peptide Substrate
Meas. Tech.
Protease Inhibition Assay
Ki
5.7±n/a nM
IC50
99±n/a nM
Citation
 Lehr, PBillich, ACharpiot, BEttmayer, PScholz, DRosenwirth, BGstach, H Inhibitors of human immunodeficiency virus type 1 protease containing 2-aminobenzyl-substituted 4-amino-3-hydroxy-5-phenylpentanoic acid: synthesis, activity, and oral bioavailability. J Med Chem 39:2060-7 (1996)  
Target
Name:
Dimer of Gag-Pol polyprotein [489-587]
Synonyms:
HIV-1 Protease
Type:
Protein Complex
Mol. Mass.:
Description:
Components:
This complex has 2 components.
Component 1
Name:
Gag-Pol polyprotein [489-587]
Synonyms:
HIV protease HIV-1 Protease chain A POL_HV1N5 | gag-pol
Type:
Enzyme Subunit
Mol. Mass.:
10822.21
Organism:
Human immunodeficiency virus type 1
Description:
P12497[489-587]
Residue:
99
  
Component 2
Name:
Gag-Pol polyprotein [489-587]
Synonyms:
HIV protease HIV-1 Protease chain A POL_HV1N5 | gag-pol
Type:
Enzyme Subunit
Mol. Mass.:
10822.21
Organism:
Human immunodeficiency virus type 1
Description:
P12497[489-587]
Residue:
99
  
Inhibitor
Name:
BDBM1225
Synonyms:
2-Aminobenzyl-Substituted AHPPA deriv. 43 | benzyl N-[(1S)-1-{[(2S,3R,4R)-4-({[4-(acetamidomethyl)phenyl]methyl}amino)-3-hydroxy-4-{[(1S,2R)-2-hydroxy-2,3-dihydro-1H-inden-1-yl]carbamoyl}-1-phenylbutan-2-yl]carbamoyl}-2,2-dimethylpropyl]carbamate
Type:
Small organic molecule
Emp. Form.:
C44H53N5O7
Mol. Mass.:
763.9209
SMILES:
CC(=O)NCc1ccc(CN[C@H]([C@H](O)[C@H](Cc2ccccc2)NC(=O)[C@@H](NC(=O)OCc2ccccc2)C(C)(C)C)C(=O)N[C@@H]2[C@H](O)Cc3ccccc23)cc1
:
Substrate
Name:
HIV Protease Peptide Substrate
Synonyms:
Type:
Peptide
Mol. Mass.:
3062.94
Organism:
Synthesized
Description:
Residue:
29