Target
Dimer of Gag-Pol polyprotein [489-587]
Ligand
BDBM1265
Substrate
Peptide substrate
Meas. Tech.
Protease Inhibition Assay
pH
5.5±n/a
Temperature
303.15±n/a K
IC50
3100±n/a nM
Citation
 deSolms, SJGiuliani, EAGuare, JPVacca, JPSanders, WMGraham, SLWiggins, JMDarke, PLSigal, ISZugay, JA Design and synthesis of HIV protease inhibitors. Variations of the carboxy terminus of the HIV protease inhibitor L-682,679. J Med Chem 34:2852-7 (1991)  
Target
Name:
Dimer of Gag-Pol polyprotein [489-587]
Synonyms:
HIV-1 Protease
Type:
Tandem linked enzyme construct
Mol. Mass.:
Description:
Components:
This complex has 2 components.
Component 1
Name:
Gag-Pol polyprotein [489-587]
Synonyms:
Human immunodeficiency virus type 1 protease Pol polyprotein | gag-pol
Type:
Enzyme Subunit
Mol. Mass.:
10781.16
Organism:
Human immunodeficiency virus type 1
Description:
P04585[489-587]
Residue:
99
  
Component 2
Name:
Gag-Pol polyprotein [489-587]
Synonyms:
Human immunodeficiency virus type 1 protease Pol polyprotein | gag-pol
Type:
Enzyme Subunit
Mol. Mass.:
10781.16
Organism:
Human immunodeficiency virus type 1
Description:
P04585[489-587]
Residue:
99
  
Inhibitor
Name:
BDBM1265
Synonyms:
L-682, 679 analog 24 | tert-butyl N-[(2S,3S,5R)-5-benzyl-5-{[(1R)-1-carbamoyl-3-methylbutyl]carbamoyl}-3-hydroxy-1-phenylpentan-2-yl]carbamate
Type:
Small organic molecule
Emp. Form.:
C30H43N3O5
Mol. Mass.:
525.6795
SMILES:
CC(C)C[C@@H](NC(=O)[C@@H](C[C@H](O)[C@H](Cc1ccccc1)NC(=O)OC(C)(C)C)Cc1ccccc1)C(N)=O
:
Substrate
Name:
Peptide substrate
Synonyms:
Type:
Peptide
Mol. Mass.:
4618.57
Organism:
Description:
Residue:
43