Target
Cyclin-dependent kinase 14
Ligand
BDBM31099
Substrate
Meas. Tech.
Kinase Inhibitor Selectivity Profiling Assay
Kd
110±n/a nM
Citation
 PubChem, PC Kinase Inhibitor Selectivity Profiling Assay PubChem Bioassay (2008)[AID] 
Target
Name:
Cyclin-dependent kinase 14
Synonyms:
CDK14 KIAA0834 Serine/threonine-protein kinase PFTAIRE-1
Type:
PROTEIN
Mol. Mass.:
53075.39
Organism:
Homo sapiens (Human)
Description:
ChEMBL_774550
Residue:
469
  
Inhibitor
Name:
BDBM31099
Synonyms:
2-(2-chlorophenyl)-5,7-dihydroxy-8-[(3S)-3-hydroxy-1-methyl-4-piperidinyl]-1-benzopyran-4-one 2-(2-chlorophenyl)-5,7-dihydroxy-8-[(3S)-3-hydroxy-1-methylpiperidin-4-yl]chromen-4-one CHEMBL45741 cid_24867231
Type:
Small organic molecule
Emp. Form.:
C21H20ClNO5
Mol. Mass.:
401.84
SMILES:
CN1CCC([C@H](O)C1)c1c(O)cc(O)c2c1oc(cc2=O)-c1ccccc1Cl
: