Target
TRAF2 and NCK-interacting protein kinase
Ligand
BDBM13531
Substrate
Meas. Tech.
Kinase Inhibitor Selectivity Profiling Assay
Kd
1600±n/a nM
Citation
 PubChem, PC Kinase Inhibitor Selectivity Profiling Assay PubChem Bioassay (2008)[AID] 
Target
Name:
TRAF2 and NCK-interacting protein kinase
Synonyms:
KIAA0551 TNIK_HUMAN TRAF2- and NCK-interacting kinase
Type:
Protein
Mol. Mass.:
154954.98
Organism:
Homo sapiens (Human)
Description:
Q9UKE5
Residue:
1360
  
Inhibitor
Name:
BDBM13531
Synonyms:
4-(4-Fluorophenyl)-2-(4-hydroxyphenyl)-5-(4-pyridyl)-1H-imidazole 4-[4-(4-fluorophenyl)-5-(4-pyridyl)-4-imidazolin-2-ylidene]cyclohexa-2,5-dien-1-one SB-202190 biotinylated SB202190
Type:
Small organic molecule
Emp. Form.:
C20H14FN3O
Mol. Mass.:
331.3431
SMILES:
Oc1ccc(cc1)-c1nc(c([nH]1)-c1ccc(F)cc1)-c1ccncc1
: