Target
Phosphorylase b kinase gamma catalytic chain, skeletal muscle/heart isoform
Ligand
BDBM5447
Substrate
Meas. Tech.
Kinase Inhibitor Selectivity Profiling Assay
Kd
3700±n/a nM
Citation
 PubChem, PC Kinase Inhibitor Selectivity Profiling Assay PubChem Bioassay (2008)[AID] 
Target
Name:
Phosphorylase b kinase gamma catalytic chain, skeletal muscle/heart isoform
Synonyms:
PHKG PHKG1_HUMAN Phosphorylase kinase Phosphorylase kinase subunit gamma 1
Type:
PROTEIN
Mol. Mass.:
45025.22
Organism:
Homo sapiens (Human)
Description:
ChEMBL_774515
Residue:
387
  
Inhibitor
Name:
BDBM5447
Synonyms:
CHEMBL939 Iressa N-(3-chloro-4-fluorophenyl)-7-methoxy-6-[3-(morpholin-4-yl)propoxy]quinazolin-4-amine US10507209, Compound Gefitinib US9730934, Gefitinib WO2022090481, Example gefitinib cid_123631
Type:
Small organic molecule
Emp. Form.:
C22H24ClFN4O3
Mol. Mass.:
446.902
SMILES:
COc1cc2ncnc(Nc3ccc(F)c(Cl)c3)c2cc1OCCCN1CCOCC1
: