Target
Myosin light chain kinase, smooth muscle
Ligand
BDBM31094
Substrate
Meas. Tech.
Kinase Inhibitor Selectivity Profiling Assay
Kd
2000±n/a nM
Citation
 PubChem, PC Kinase Inhibitor Selectivity Profiling Assay PubChem Bioassay (2008)[AID] 
Target
Name:
Myosin light chain kinase, smooth muscle
Synonyms:
KRP MLCK MYLK MYLK_HUMAN Telokin | smMLCK
Type:
Protein
Mol. Mass.:
210702.56
Organism:
Homo sapiens (Human)
Description:
Q15746
Residue:
1914
  
Inhibitor
Name:
BDBM31094
Synonyms:
PKC-412 | cid_24202429
Type:
Small organic molecule
Emp. Form.:
C35H30N4O4
Mol. Mass.:
570.6371
SMILES:
[H][C@@]12C[C@@H]([C@H](OC)[C@@](C)(O1)n1c3ccccc3c3c4CNC(=O)c4c4c5ccccc5n2c4c13)N(C)C(=O)c1ccccc1
: