Target
Serine/threonine-protein kinase Nek9
Ligand
BDBM25118
Substrate
Meas. Tech.
Kinase Inhibitor Selectivity Profiling Assay
Kd
9100±n/a nM
Citation
 PubChem, PC Kinase Inhibitor Selectivity Profiling Assay PubChem Bioassay (2008)[AID] 
Target
Name:
Serine/threonine-protein kinase Nek9
Synonyms:
KIAA1995 NEK8 NEK9_HUMAN | NERCC
Type:
PROTEIN
Mol. Mass.:
107154.21
Organism:
Homo sapiens (Human)
Description:
ChEMBL_774184
Residue:
979
  
Inhibitor
Name:
BDBM25118
Synonyms:
(3Z)-4-amino-5-fluoro-3-[5-(4-methylpiperazino)-1,3-dihydrobenzimidazol-2-ylidene]carbostyril CHEMBL522892 | CHIR-258
Type:
Small organic molecule
Emp. Form.:
C21H21FN6O
Mol. Mass.:
392.4294
SMILES:
CN1CCN(CC1)c1ccc2nc([nH]c2c1)-c1c(N)c2c(F)cccc2[nH]c1=O
: