Target
Phosphorylase b kinase gamma catalytic chain, liver/testis isoform
Ligand
BDBM31094
Substrate
Meas. Tech.
Kinase Inhibitor Selectivity Profiling Assay
Kd
1400±n/a nM
Citation
 PubChem, PC Kinase Inhibitor Selectivity Profiling Assay PubChem Bioassay (2008)[AID] 
Target
Name:
Phosphorylase b kinase gamma catalytic chain, liver/testis isoform
Synonyms:
PHKG2 Phosphorylase kinase | Phosphorylase kinase gamma subunit 2
Type:
PROTEIN
Mol. Mass.:
46440.15
Organism:
Homo sapiens (Human)
Description:
ChEMBL_774277
Residue:
406
  
Inhibitor
Name:
BDBM31094
Synonyms:
PKC-412 | cid_24202429
Type:
Small organic molecule
Emp. Form.:
C35H30N4O4
Mol. Mass.:
570.6371
SMILES:
[H][C@@]12C[C@@H]([C@H](OC)[C@@](C)(O1)n1c3ccccc3c3c4CNC(=O)c4c4c5ccccc5n2c4c13)N(C)C(=O)c1ccccc1
: