Target
Activin receptor type-1
Ligand
BDBM21
Substrate
Meas. Tech.
Kinase Inhibitor Selectivity Profiling Assay
Kd
150±n/a nM
Citation
 PubChem, PC Kinase Inhibitor Selectivity Profiling Assay PubChem Bioassay (2008)[AID] 
Target
Name:
Activin receptor type-1
Synonyms:
2.7.11.30 ACVR1 ACVRLK2 ALK2/ACVR1 Activin receptor-like kinase 2 Activin receptor-like kinase 2 (ALK2/ACVR1) SKR1 TGF-B superfamily receptor type I | TSR-I
Type:
Mol. Mass.:
57158.32
Organism:
Homo sapiens (Human)
Description:
Residue:
509
  
Inhibitor
Name:
BDBM21
Synonyms:
CHEMBL24828 VANDETANIB ZD6474 | cid_3081361
Type:
Emp. Form.:
C22H24BrFN4O2
Mol. Mass.:
475.354
SMILES:
COc1cc2c(Nc3ccc(Br)cc3F)ncnc2cc1OCC1CCN(C)CC1
: