Target
Ribosomal protein S6 kinase alpha-1
Ligand
BDBM31096
Substrate
Meas. Tech.
Kinase Inhibitor Selectivity Profiling Assay
Ki
1200000±n/a nM
Citation
 PubChem, PC Kinase Inhibitor Selectivity Profiling Assay PubChem Bioassay (2008)[AID] 
Target
Name:
Ribosomal protein S6 kinase alpha-1
Synonyms:
90 kDa ribosomal protein S6 kinase 1 MAP kinase-activated protein kinase 1a RPS6KA1 RPS6KA1(Kin.Dom.2 - C-terminal) RSK1 Ribosomal S6 kinase 1 Ribosomal protein S6 kinase alpha 1 Ribosomal protein S6 kinase alpha-1 (RSK1) p90-RSK 1 p90S6K | pp90RSK1
Type:
Serine/threonine-protein kinase
Mol. Mass.:
82736.10
Organism:
Homo sapiens (Human)
Description:
Residue:
735
  
Inhibitor
Name:
BDBM31096
Synonyms:
CHEMBL290084 cid_451705
Type:
Small organic molecule
Emp. Form.:
C28H26N4O3
Mol. Mass.:
466.531
SMILES:
CN[C@H]1C[C@@H]2O[C@](C)([C@H]1OC)n1c3ccccc3c3c4CNC(=O)c4c4c5ccccc5n2c4c13
: