Target
Gag-Pol polyprotein [600-1027,Y780C]/[600-1155,Y780C]
Ligand
BDBM1520
Substrate
poly(rC):oligo(dG)
Meas. Tech.
HIV-1 RT Assay
pH
7.8±n/a
Temperature
298.15±n/a K
IC50
>1000±n/a nM
Citation
 Proudfoot, JRHargrave, KDKapadia, SRPatel, URGrozinger, KGMcNeil, DWCullen, ECardozo, MTong, LKelly, TA Novel non-nucleoside inhibitors of human immunodeficiency virus type 1 (HIV-1) reverse transcriptase. 4. 2-Substituted dipyridodiazepinones as potent inhibitors of both wild-type and cysteine-181 HIV-1 reverse transcriptase enzymes. J Med Chem 38:4830-8 (1995)  
Target
Name:
Gag-Pol polyprotein [600-1027,Y780C]/[600-1155,Y780C]
Synonyms:
EC: 2.7.7.49 | HIV-1 Reverse Transcriptase Mutant (Y181C)
Type:
Protein Complex
Mol. Mass.:
115564
Description:
Components:
This complex has 2 components.
Component 1
Name:
Gag-Pol polyprotein [600-1155,Y780C]
Synonyms:
HIV-1 Reverse Transcriptase Mutant (Y181C) Chain A gag-pol
Type:
Enzyme Subunit
Mol. Mass.:
63868.77
Organism:
Human immunodeficiency virus type 1
Description:
P03366[600-1155,Y780C]
Residue:
556
  
Component 2
Name:
Gag-Pol polyprotein [600-1027,Y780C]
Synonyms:
HIV-1 Reverse Transcriptase Mutant (Y181C) Chain B gag-pol
Type:
Enzyme Subunit
Mol. Mass.:
49908.60
Organism:
Human immunodeficiency virus type 1
Description:
P03366[600-1027,Y780C]
Residue:
428
  
Inhibitor
Name:
BDBM1520
Synonyms:
2-ethyl-5,7-dimethyl-2,4,9,15-tetraazatricyclo[9.4.0.0^{3,8}]pentadeca-1(11),3,5,7,12,14-hexaen-10-one | Dipyridodiazepinone deriv. 5
Type:
Small organic molecule
Emp. Form.:
C15H16N4O
Mol. Mass.:
268.3137
SMILES:
CCN1c2nc(C)cc(C)c2NC(=O)c2cccnc12
:
Substrate
Name:
poly(rC):oligo(dG)
Synonyms:
Type:
RNA-DNA duplex
Mol. Mass.:
358.43
Organism:
Description:
The incorporation of Tritium-labeled [3H]dGTP onto a (poly)rC:(oligo)dG template:primer.
Residue:
3
NA