Target
Calcium/calmodulin-dependent protein kinase type 1D
Ligand
BDBM31096
Substrate
Meas. Tech.
Kinase Inhibitor Selectivity Profiling Assay
Kd
1.1±n/a nM
Citation
 PubChem, PC Kinase Inhibitor Selectivity Profiling Assay PubChem Bioassay (2008)[AID] 
Target
Name:
Calcium/calmodulin-dependent protein kinase type 1D
Synonyms:
CAMK1D CaM kinase I delta | KCC1D_HUMAN
Type:
PROTEIN
Mol. Mass.:
42916.83
Organism:
Homo sapiens (Human)
Description:
ChEMBL_586559
Residue:
385
  
Inhibitor
Name:
BDBM31096
Synonyms:
CHEMBL290084 cid_451705
Type:
Small organic molecule
Emp. Form.:
C28H26N4O3
Mol. Mass.:
466.531
SMILES:
CN[C@H]1C[C@@H]2O[C@](C)([C@H]1OC)n1c3ccccc3c3c4CNC(=O)c4c4c5ccccc5n2c4c13
: