Target
Aldo-keto reductase family 1 member C3
Ligand
BDBM264475
Substrate
Meas. Tech.
AKR1C3-Inhibitory Action
pH
7±n/a
IC50
4.00±n/a nM
Comments
extracted
Citation
 Bothe, UBusemann, MBarak, NRotgeri, AFischer, OMMarquardt, T Estra-1,3,5(10),16-tetraene-3-carboxamides for inhibition of 17.beta.-hydroxysteroid dehydrogenase (AKR1C3) US Patent  US9714266 Publication Date 7/25/2017 
Target
Name:
Aldo-keto reductase family 1 member C3
Synonyms:
17-beta-Hydroxysteroid Dehydrogenase 5 (17-beta-HSD5, AKR1C3) AK1C3_HUMAN Aldo-keto reductase family 1 member C3 Aldo-keto reductase family 1 member C3 (AK1C3a) Aldo-keto-reductase family 1 member C3 Dihydrodiol dehydrogenase 3 Estradiol 17-beta-dehydrogenase KIAA0119 Prostaglandin F synthase Trans-1,2-dihydrobenzene-1,2-diol dehydrogenase
Type:
Enzyme
Mol. Mass.:
36859.86
Organism:
Homo sapiens (Human)
Description:
P42330
Residue:
323
  
Inhibitor
Name:
BDBM264475
Synonyms:
17-oxooestra-1,3,5(10)-triene-3,11a-diyl diacetate | US9714266, 4
Type:
Small organic molecule
Emp. Form.:
C22H26O5
Mol. Mass.:
370.4388
SMILES:
[H][C@@]12CCC(=O)[C@@]1(C)C[C@@H](OC(C)=O)[C@]1([H])c3ccc(OC(C)=O)cc3CC[C@@]21[H]
: