Target
Sphingosine 1-phosphate receptor 1
Ligand
BDBM37112
Substrate
Meas. Tech.
Dose Response Assays for S1P1 Agonists and Agonism Potentiators - Potentiator Assay 60K MLSMR
EC50
58020±n/a nM
Citation
 PubChem, PC Dose Response Assays for S1P1 Agonists and Agonism Potentiators - Potentiator Assay 60K MLSMR PubChem Bioassay (2007)[AID] 
Target
Name:
Sphingosine 1-phosphate receptor 1
Synonyms:
CHEDG1 Endothelial differentiation G-protein coupled receptor 1 S1P1 S1PR1_HUMAN Sphingosine 1-phosphate receptor Edg-1
Type:
Enzyme
Mol. Mass.:
42836.02
Organism:
Homo sapiens (Human)
Description:
P21453
Residue:
382
  
Inhibitor
Name:
BDBM37112
Synonyms:
MLS000099936 N-(2-cyclohexyl-1,3-dioxo-2,3-dihydro-1H-isoindol-5-yl)propanamide N-(2-cyclohexyl-1,3-dioxoisoindol-5-yl)propanamide SMR000081105 | cid_2227998
Type:
Small organic molecule
Emp. Form.:
C17H20N2O3
Mol. Mass.:
300.3523
SMILES:
CCC(=O)Nc1ccc2C(=O)N(C3CCCCC3)C(=O)c2c1
: