Target
Sphingosine 1-phosphate receptor 1
Ligand
BDBM37205
Substrate
Meas. Tech.
Dose Response Assays for S1P1 Agonists and Agonism Potentiators - Potentiator Assay 60K MLSMR
EC50
>10000±n/a nM
Citation
 PubChem, PC Dose Response Assays for S1P1 Agonists and Agonism Potentiators - Potentiator Assay 60K MLSMR PubChem Bioassay (2007)[AID] 
Target
Name:
Sphingosine 1-phosphate receptor 1
Synonyms:
CHEDG1 Endothelial differentiation G-protein coupled receptor 1 S1P1 S1PR1_HUMAN Sphingosine 1-phosphate receptor Edg-1
Type:
Enzyme
Mol. Mass.:
42836.02
Organism:
Homo sapiens (Human)
Description:
P21453
Residue:
382
  
Inhibitor
Name:
BDBM37205
Synonyms:
4-(dimethylsulfamoyl)-N-(4-thiophen-2-yl-1,3-thiazol-2-yl)benzamide 4-(dimethylsulfamoyl)-N-[4-(2-thienyl)thiazol-2-yl]benzamide SMR000017337 | cid_1356309
Type:
Small organic molecule
Emp. Form.:
C16H15N3O3S3
Mol. Mass.:
393.504
SMILES:
CN(C)S(=O)(=O)c1ccc(cc1)C(=O)Nc1nc(cs1)-c1cccs1
: