Target
Genome polyprotein
Ligand
BDBM403639
Substrate
Meas. Tech.
Ki Determination for Genotypes 1b and 3a NS3 Protease
Ki
0.070±n/a nM
Citation
 Bjornson, KCanales, ECottell, JJKarki, KKKatana, AAKato, DKobayashi, TLink, JOMartinez, RPhillips, BWPyun, HSangi, MSchrier, AJSiegel, DTaylor, JGTran, CVTrejo Martin, TAVivian, RWYang, ZZablocki, JZipfel, S Inhibitors of hepatitis C virus US Patent  US10335409 Publication Date 7/2/2019 
Target
Name:
Genome polyprotein
Synonyms:
HCV 3a POLG_HCVK3
Type:
Enzyme Catalytic Domain
Mol. Mass.:
328455.91
Organism:
Hepatitis C virus genotype 3a (isolate k3a) (HCV)
Description:
Q81495
Residue:
3021
  
Inhibitor
Name:
BDBM403639
Synonyms:
(1aS,2aR,6S,9S,10S,11R,23aR,23bS)-6-tert-butyl-N-[(1R,2R)-2-(difluoromethyl)-1-{[(1-methylcyclopropyl)sulfonyl]carbamoyl}cyclopropyl]-15-methoxy-10-methyl-4,7-dioxo-1a,2,2a,4,5,6,7,10,11,19,20,21,22,23,23a,23b-hexadecahydro-1H,9H-8,11-methanocyclopropa[4′,5′]cyclopenta[1′,2′:18,19][1,10,3,6]dioxadiazacyclononadecino[11,12-b]quinoxaline-9-carboxamide | US10335409, Example 49
Type:
Small organic molecule
Emp. Form.:
C42H56F2N6O9S
Mol. Mass.:
858.991
SMILES:
COc1ccc2nc3CCCCC[C@@H]4[C@H]5C[C@H]5C[C@H]4OC(=O)N[C@H](C(=O)N4C[C@H](Oc3nc2c1)[C@@H](C)[C@H]4C(=O)N[C@@]1(C[C@H]1C(F)F)C(=O)NS(=O)(=O)C1(C)CC1)C(C)(C)C
: