Target
Genome polyprotein
Ligand
BDBM403662
Substrate
Meas. Tech.
Ki Determination for Genotypes 1b and 3a NS3 Protease
Ki
0.050±n/a nM
Citation
 Bjornson, KCanales, ECottell, JJKarki, KKKatana, AAKato, DKobayashi, TLink, JOMartinez, RPhillips, BWPyun, HSangi, MSchrier, AJSiegel, DTaylor, JGTran, CVTrejo Martin, TAVivian, RWYang, ZZablocki, JZipfel, S Inhibitors of hepatitis C virus US Patent  US10335409 Publication Date 7/2/2019 
Target
Name:
Genome polyprotein
Synonyms:
HCV Polymerase (S282T) NS3/4A Protein POLG_HCVJA
Type:
Protein
Mol. Mass.:
327076.78
Organism:
Hepatitis C Virus (Virus)
Description:
P26662
Residue:
3010
  
Inhibitor
Name:
BDBM403662
Synonyms:
(4aS,8S,11S,12S,13R,25aS)-8-tert-butyl-N-[(1R,2R)-1-[(cyclopropylsulfonyl)carbamoyl]-2-(difluoromethyl)cyclopropyl]-17-methoxy-12-methyl-6,9-dioxo-2,3,4,4a,6,7,8,9,12,13,21,22,23,24,25,25a-hexadecahydro-1H,11H-1,3:10,13-dimethanoquinoxalino[2,3-k][1,10,3,6]benzodioxadiazacyclononadecine-11-carboxamide | US10335409, Example 72
Type:
Small organic molecule
Emp. Form.:
C42H56F2N6O9S
Mol. Mass.:
858.991
SMILES:
COc1ccc2nc3CCCCC[C@H]4C5CC(C5)C[C@@H]4OC(=O)N[C@H](C(=O)N4C[C@H](Oc3nc2c1)[C@@H](C)[C@H]4C(=O)N[C@@]1(C[C@H]1C(F)F)C(=O)NS(=O)(=O)C1CC1)C(C)(C)C
: