Target
Sphingosine 1-phosphate receptor 1
Ligand
BDBM37099
Substrate
Meas. Tech.
Dose Response Assays for S1P1 Agonists and Agonism Potentiators - Agonist Assay 60K MLSMR
EC50
9856±n/a nM
Citation
 PubChem, PC Dose Response Assays for S1P1 Agonists and Agonism Potentiators - Agonist Assay 60K MLSMR PubChem Bioassay (2007)[AID] 
Target
Name:
Sphingosine 1-phosphate receptor 1
Synonyms:
CHEDG1 Endothelial differentiation G-protein coupled receptor 1 S1P1 S1PR1_HUMAN Sphingosine 1-phosphate receptor Edg-1
Type:
Enzyme
Mol. Mass.:
42836.02
Organism:
Homo sapiens (Human)
Description:
P21453
Residue:
382
  
Inhibitor
Name:
BDBM37099
Synonyms:
1-(8-quinolinylsulfonyl)-N-[4-(trifluoromethyl)phenyl]-2-pyrrolidinecarboxamide 1-(quinolin-8-ylsulfonyl)-N-[4-(trifluoromethyl)phenyl]prolinamide MLS000093309 cid_3245750
Type:
Small organic molecule
Emp. Form.:
C21H18F3N3O3S
Mol. Mass.:
449.446
SMILES:
FC(F)(F)c1ccc(NC(=O)C2CCCN2S(=O)(=O)c2cccc3cccnc23)cc1
: