Target
fMet-Leu-Phe receptor
Ligand
BDBM37686
Substrate
Meas. Tech.
Dose Response Assay for Formylpeptide Receptor (FPR) Ligands and Dose Response Counter-Screen Assay for Formylpeptide-Like-1 (FPRL1) Ligands
Ki
>43700±n/a nM
Citation
 PubChem, PC Dose Response Assay for Formylpeptide Receptor (FPR) Ligands and Dose Response Counter-Screen Assay for Formylpeptide-Like-1 (FPRL1) Ligands PubChem Bioassay (2007)[AID] 
Target
Name:
fMet-Leu-Phe receptor
Synonyms:
FPR FPR1_HUMAN N-formyl peptide receptor 1 fMLP receptor formyl peptide receptor 1
Type:
Enzyme Catalytic Domain
Mol. Mass.:
38456.14
Organism:
Homo sapiens (Human)
Description:
gi_4503779
Residue:
350
  
Inhibitor
Name:
BDBM37686
Synonyms:
2-(4-benzylpiperazin-1-yl)-4-(3,4-dimethoxyphenyl)-6-(trifluoromethyl)pyrimidine 4-(3,4-dimethoxyphenyl)-2-[4-(phenylmethyl)-1-piperazinyl]-6-(trifluoromethyl)pyrimidine MLS000044552 cid_2992722
Type:
Small organic molecule
Emp. Form.:
C24H25F3N4O2
Mol. Mass.:
458.4761
SMILES:
COc1ccc(cc1OC)-c1cc(nc(n1)N1CCN(Cc2ccccc2)CC1)C(F)(F)F
: