Target
fMet-Leu-Phe receptor
Ligand
BDBM37770
Substrate
Meas. Tech.
Dose Response Assay for Formylpeptide Receptor (FPR) Ligands and Dose Response Counter-Screen Assay for Formylpeptide-Like-1 (FPRL1) Ligands
Ki
27900±n/a nM
Citation
 PubChem, PC Dose Response Assay for Formylpeptide Receptor (FPR) Ligands and Dose Response Counter-Screen Assay for Formylpeptide-Like-1 (FPRL1) Ligands PubChem Bioassay (2007)[AID] 
Target
Name:
fMet-Leu-Phe receptor
Synonyms:
FPR FPR1_HUMAN N-formyl peptide receptor 1 fMLP receptor formyl peptide receptor 1
Type:
Enzyme Catalytic Domain
Mol. Mass.:
38456.14
Organism:
Homo sapiens (Human)
Description:
gi_4503779
Residue:
350
  
Inhibitor
Name:
BDBM37770
Synonyms:
3-(5-methylfuran-2-yl)carbonyl-4-oxidanyl-2-(4-propoxyphenyl)-1-(pyridin-3-ylmethyl)-2H-pyrrol-5-one 3-hydroxy-4-(5-methyl-2-furoyl)-5-(4-propoxyphenyl)-1-(3-pyridylmethyl)-3-pyrrolin-2-one 4-hydroxy-3-[(5-methyl-2-furanyl)-oxomethyl]-2-(4-propoxyphenyl)-1-(3-pyridinylmethyl)-2H-pyrrol-5-one SMR000075296 | cid_2949891
Type:
Small organic molecule
Emp. Form.:
C25H24N2O5
Mol. Mass.:
432.4685
SMILES:
CCCOc1ccc(cc1)C1C(C(=O)c2ccc(C)o2)C(=O)C(=O)N1Cc1cccnc1
: