Target
fMet-Leu-Phe receptor
Ligand
BDBM37790
Substrate
Meas. Tech.
Dose Response Assay for Formylpeptide Receptor (FPR) Ligands and Dose Response Counter-Screen Assay for Formylpeptide-Like-1 (FPRL1) Ligands
Ki
8200±n/a nM
Citation
 PubChem, PC Dose Response Assay for Formylpeptide Receptor (FPR) Ligands and Dose Response Counter-Screen Assay for Formylpeptide-Like-1 (FPRL1) Ligands PubChem Bioassay (2007)[AID] 
Target
Name:
fMet-Leu-Phe receptor
Synonyms:
FPR FPR1_HUMAN N-formyl peptide receptor 1 fMLP receptor formyl peptide receptor 1
Type:
Enzyme Catalytic Domain
Mol. Mass.:
38456.14
Organism:
Homo sapiens (Human)
Description:
gi_4503779
Residue:
350
  
Inhibitor
Name:
BDBM37790
Synonyms:
6,6-dimethyl-9-(3-methyl-2-thienyl)-1,5,7,9-tetrahydro-[1,2,4]triazolo[5,1-b]quinazolin-8-one 6,6-dimethyl-9-(3-methylthiophen-2-yl)-1,5,7,9-tetrahydro-[1,2,4]triazolo[5,1-b]quinazolin-8-one SMR000091825 | cid_5307673
Type:
Small organic molecule
Emp. Form.:
C16H18N4OS
Mol. Mass.:
314.405
SMILES:
Cc1ccsc1C1C2C(=O)CC(C)(C)CC2=Nc2ncnn12
: