Target
N-formyl peptide receptor 2
Ligand
BDBM37843
Substrate
Meas. Tech.
Dose Response Assay for Formylpeptide Receptor-Like-1 (FPRL1) Ligands and Dose Response Counter-Screen Assay for Formylpeptide Receptor (FPR) Ligands
Ki
>40300±n/a nM
Comments
Extracted from aid = 520 and tid = 2
Citation
 PubChem, PC Dose Response Assay for Formylpeptide Receptor-Like-1 (FPRL1) Ligands and Dose Response Counter-Screen Assay for Formylpeptide Receptor (FPR) Ligands PubChem Bioassay (2007)[AID] 
Target
Name:
N-formyl peptide receptor 2
Synonyms:
ALXR, FPRL1, FPR2 FPR2 FPRH1 Formyl Peptide Receptor-Like 1 LXA4 receptor Lipoxin A4 receptor RFP | hFPRL
Type:
G Protein-Coupled Receptor (GPCR)
Mol. Mass.:
38968.35
Organism:
Homo sapiens (Human)
Description:
P25090
Residue:
351
  
Inhibitor
Name:
BDBM37843
Synonyms:
2-furancarboxylic acid [3-(2-ethoxyphenoxy)-2-methyl-4-oxo-1-benzopyran-7-yl] ester MLS000559617 [3-(2-ethoxyphenoxy)-2-methyl-4-oxidanylidene-chromen-7-yl] furan-2-carboxylate cid_1998413 | furan-2-carboxylic acid [3-(2-ethoxyphenoxy)-4-keto-2-methyl-chromen-7-yl] ester
Type:
Small organic molecule
Emp. Form.:
C23H18O7
Mol. Mass.:
406.3848
SMILES:
CCOc1ccccc1Oc1c(C)oc2cc(OC(=O)c3ccco3)ccc2c1=O
: