Target
N-formyl peptide receptor 2
Ligand
BDBM37745
Substrate
Meas. Tech.
Dose Response Assay for Formylpeptide Receptor-Like-1 (FPRL1) Ligands and Dose Response Counter-Screen Assay for Formylpeptide Receptor (FPR) Ligands
IC50
11200±n/a nM
Comments
Extracted from aid = 520 and tid = 3
Citation
 PubChem, PC Dose Response Assay for Formylpeptide Receptor-Like-1 (FPRL1) Ligands and Dose Response Counter-Screen Assay for Formylpeptide Receptor (FPR) Ligands PubChem Bioassay (2007)[AID] 
Target
Name:
N-formyl peptide receptor 2
Synonyms:
ALXR, FPRL1, FPR2 FPR2 FPRH1 Formyl Peptide Receptor-Like 1 LXA4 receptor Lipoxin A4 receptor RFP | hFPRL
Type:
G Protein-Coupled Receptor (GPCR)
Mol. Mass.:
38968.35
Organism:
Homo sapiens (Human)
Description:
P25090
Residue:
351
  
Inhibitor
Name:
BDBM37745
Synonyms:
2-[[4-methyl-5-[[(3,4,5-triethoxybenzoyl)amino]methyl]-1,2,4-triazol-3-yl]thio]acetic acid ethyl ester MLS000087568 cid_3244491 ethyl 2-[[4-methyl-5-[[(3,4,5-triethoxyphenyl)carbonylamino]methyl]-1,2,4-triazol-3-yl]sulfanyl]ethanoate | ethyl [(4-methyl-5-{[(3,4,5-triethoxybenzoyl)amino]methyl}-4H-1,2,4-triazol-3-yl)thio]acetate
Type:
Small organic molecule
Emp. Form.:
C21H30N4O6S
Mol. Mass.:
466.551
SMILES:
CCOC(=O)CSc1nnc(CNC(=O)c2cc(OCC)c(OCC)c(OCC)c2)n1C
: