Target
M-phase inducer phosphatase 2
Ligand
BDBM25766
Substrate
Meas. Tech.
Cdc25B Catalytic Domain Protein Tyrosine Phosphatase HTS Dose Response Confirmation Assay
IC50
>50000±n/a nM
Citation
 PubChem, PC Cdc25B Catalytic Domain Protein Tyrosine Phosphatase HTS Dose Response Confirmation Assay PubChem Bioassay (2006)[AID] 
Target
Name:
M-phase inducer phosphatase 2
Synonyms:
CDC25B Dual specificity phosphatase (CDC25B) M-phase inducer phosphatase 2 (CDC25B) | MPIP2_HUMAN
Type:
Protein
Mol. Mass.:
64985.27
Organism:
Homo sapiens (Human)
Description:
Residue:
580
  
Inhibitor
Name:
BDBM25766
Synonyms:
(2R,3S)-5-[3-(tert-butylamino)-2-hydroxypropoxy]-1,2,3,4-tetrahydronaphthalene-2,3-diol Corgard Solgol | cid_39147
Type:
Small organic molecule
Emp. Form.:
C17H27NO4
Mol. Mass.:
309.4006
SMILES:
CC(C)(C)NCC(O)COc1cccc2C[C@@H](O)[C@@H](O)Cc12
: