Target
Steroidogenic factor 1
Ligand
BDBM38914
Substrate
Meas. Tech.
Dose-response cell-based assay for inhibitors of the nuclear receptor Steroidogenic Factor 1 (SF-1)
IC50
58±n/a nM
Citation
 PubChem, PC Dose-response cell-based assay for inhibitors of the nuclear receptor Steroidogenic Factor 1 (SF-1) PubChem Bioassay (2007)[AID] 
Target
Name:
Steroidogenic factor 1
Synonyms:
AD4BP FTZF1 NR5A1 SF-1 STF-1 Steroid hormone receptor Ad4BP
Type:
Nuclear Hormone Receptor
Mol. Mass.:
51643.43
Organism:
Homo sapiens (Human)
Description:
Residue:
461
  
Inhibitor
Name:
BDBM38914
Synonyms:
3-[3-(4-tert-butylphenyl)-1,2,4-oxadiazol-5-yl]-N-methyl-propanamide 3-[3-(4-tert-butylphenyl)-1,2,4-oxadiazol-5-yl]-N-methylpropanamide SMR000046910 | cid_665654
Type:
Small organic molecule
Emp. Form.:
C16H21N3O2
Mol. Mass.:
287.3568
SMILES:
CNC(=O)CCc1nc(no1)-c1ccc(cc1)C(C)(C)C
: