Target
Steroidogenic factor 1
Ligand
BDBM38917
Substrate
Meas. Tech.
Dose-response cell-based assay for inhibitors of the nuclear receptor Steroidogenic Factor 1 (SF-1)
IC50
69±n/a nM
Citation
 PubChem, PC Dose-response cell-based assay for inhibitors of the nuclear receptor Steroidogenic Factor 1 (SF-1) PubChem Bioassay (2007)[AID] 
Target
Name:
Steroidogenic factor 1
Synonyms:
AD4BP FTZF1 NR5A1 SF-1 STF-1 Steroid hormone receptor Ad4BP
Type:
Nuclear Hormone Receptor
Mol. Mass.:
51643.43
Organism:
Homo sapiens (Human)
Description:
Residue:
461
  
Inhibitor
Name:
BDBM38917
Synonyms:
3-[3-(4-tert-butylphenyl)-1,2,4-oxadiazol-5-yl]propanamide MLS000042471 cid_666941
Type:
Small organic molecule
Emp. Form.:
C15H19N3O2
Mol. Mass.:
273.3303
SMILES:
CC(C)(C)c1ccc(cc1)-c1noc(CCC(N)=O)n1
: