Target
Steroidogenic factor 1
Ligand
BDBM38888
Substrate
Meas. Tech.
Counterscreen for inhibitors of the Retinoic Acid Receptor-related orphan receptor A (RORA): A cell-based dose-response assay for inhibition of the Steroidogenic Factor 1 (SF-1)
IC50
>3667±n/a nM
Citation
 PubChem, PC Counterscreen for inhibitors of the Retinoic Acid Receptor-related orphan receptor A (RORA): A cell-based dose-response assay for inhibition of the Steroidogenic Factor 1 (SF-1) PubChem Bioassay (2007)[AID] 
Target
Name:
Steroidogenic factor 1
Synonyms:
AD4BP FTZF1 NR5A1 SF-1 STF-1 Steroid hormone receptor Ad4BP
Type:
Nuclear Hormone Receptor
Mol. Mass.:
51643.43
Organism:
Homo sapiens (Human)
Description:
Residue:
461
  
Inhibitor
Name:
BDBM38888
Synonyms:
5-(4-chlorophenyl)-N-(3,4,5,6-tetrahydro-2H-azepin-7-yl)-1,3,4-oxadiazol-2-amine SMR000039803 cid_658858
Type:
Small organic molecule
Emp. Form.:
C14H15ClN4O
Mol. Mass.:
290.748
SMILES:
Clc1ccc(cc1)-c1nnc(NC2=NCCCCC2)o1
: