Target
Steroidogenic factor 1
Ligand
BDBM36993
Substrate
Meas. Tech.
Counterscreen for inhibitors of the Retinoic Acid Receptor-related orphan receptor A (RORA): A cell-based dose-response assay for inhibition of the Steroidogenic Factor 1 (SF-1)
IC50
>45.27±n/a nM
Citation
 PubChem, PC Counterscreen for inhibitors of the Retinoic Acid Receptor-related orphan receptor A (RORA): A cell-based dose-response assay for inhibition of the Steroidogenic Factor 1 (SF-1) PubChem Bioassay (2007)[AID] 
Target
Name:
Steroidogenic factor 1
Synonyms:
AD4BP FTZF1 NR5A1 SF-1 STF-1 Steroid hormone receptor Ad4BP
Type:
Nuclear Hormone Receptor
Mol. Mass.:
51643.43
Organism:
Homo sapiens (Human)
Description:
Residue:
461
  
Inhibitor
Name:
BDBM36993
Synonyms:
3-methyl-2-thiophenecarboxylic acid [2-[2,5-dimethyl-1-(2-oxolanylmethyl)-3-pyrrolyl]-2-oxoethyl] ester MLS000053502 [2-[2,5-dimethyl-1-(oxolan-2-ylmethyl)pyrrol-3-yl]-2-oxidanylidene-ethyl] 3-methylthiophene-2-carboxylate cid_2998797
Type:
Small organic molecule
Emp. Form.:
C19H23NO4S
Mol. Mass.:
361.455
SMILES:
Cc1ccsc1C(=O)OCC(=O)c1cc(C)n(CC2CCCO2)c1C
: