Target
Steroidogenic factor 1
Ligand
BDBM38961
Substrate
Meas. Tech.
Counterscreen for inhibitors of the Retinoic Acid Receptor-related orphan receptor A (RORA): A cell-based dose-response assay for inhibition of the Steroidogenic Factor 1 (SF-1)
IC50
329±n/a nM
Citation
 PubChem, PC Counterscreen for inhibitors of the Retinoic Acid Receptor-related orphan receptor A (RORA): A cell-based dose-response assay for inhibition of the Steroidogenic Factor 1 (SF-1) PubChem Bioassay (2007)[AID] 
Target
Name:
Steroidogenic factor 1
Synonyms:
AD4BP FTZF1 NR5A1 SF-1 STF-1 Steroid hormone receptor Ad4BP
Type:
Nuclear Hormone Receptor
Mol. Mass.:
51643.43
Organism:
Homo sapiens (Human)
Description:
Residue:
461
  
Inhibitor
Name:
BDBM38961
Synonyms:
2-(4-methyl-1-piperidinyl)-1,3-benzothiazole-6-carboxylic acid 2-(4-methylpiperidino)-1,3-benzothiazole-6-carboxylic acid SMR000029293 | cid_3238343
Type:
Small organic molecule
Emp. Form.:
C14H16N2O2S
Mol. Mass.:
276.354
SMILES:
CC1CCN(CC1)c1nc2ccc(cc2s1)C(O)=O
: