Target
Isoform 2 of Nuclear receptor ROR-alpha (Alpha-2)
Ligand
BDBM39421
Substrate
Meas. Tech.
Counterscreen for activators of the nuclear receptor Steroidogenic Factor 1 (SF-1): A cell-based dose-response assay for inhibition of the RAR-related orphan receptor A (RORA)
EC50
>407±n/a nM
Citation
 PubChem, PC Counterscreen for activators of the nuclear receptor Steroidogenic Factor 1 (SF-1): A cell-based dose-response assay for inhibition of the RAR-related orphan receptor A (RORA) PubChem Bioassay (2007)[AID] 
Target
Name:
Isoform 2 of Nuclear receptor ROR-alpha (Alpha-2)
Synonyms:
NR1F1 Nuclear receptor ROR-alpha (Alpha-2) RORA RZRA
Type:
PROTEIN
Mol. Mass.:
63033.59
Organism:
Homo sapiens (Human)
Description:
EBI_101591
Residue:
556
  
Inhibitor
Name:
BDBM39421
Synonyms:
5-Methyl-furan-2-carboxylic acid [5-(4-fluoro-benzyl)-thiazol-2-yl]-amide N-[5-(4-fluorobenzyl)thiazol-2-yl]-5-methyl-2-furamide N-[5-[(4-fluorophenyl)methyl]-1,3-thiazol-2-yl]-5-methylfuran-2-carboxamide SMR000015229 | cid_646081
Type:
Small organic molecule
Emp. Form.:
C16H13FN2O2S
Mol. Mass.:
316.35
SMILES:
Cc1ccc(o1)C(=O)Nc1ncc(Cc2ccc(F)cc2)s1
: