Target
Isoform 2 of Nuclear receptor ROR-alpha (Alpha-2)
Ligand
BDBM39442
Substrate
Meas. Tech.
Counterscreen for activators of the nuclear receptor Steroidogenic Factor 1 (SF-1): A cell-based dose-response assay for inhibition of the RAR-related orphan receptor A (RORA)
EC50
766±n/a nM
Citation
 PubChem, PC Counterscreen for activators of the nuclear receptor Steroidogenic Factor 1 (SF-1): A cell-based dose-response assay for inhibition of the RAR-related orphan receptor A (RORA) PubChem Bioassay (2007)[AID] 
Target
Name:
Isoform 2 of Nuclear receptor ROR-alpha (Alpha-2)
Synonyms:
NR1F1 Nuclear receptor ROR-alpha (Alpha-2) RORA RZRA
Type:
PROTEIN
Mol. Mass.:
63033.59
Organism:
Homo sapiens (Human)
Description:
EBI_101591
Residue:
556
  
Inhibitor
Name:
BDBM39442
Synonyms:
1,2-dimethoxy-4bH-isoindolo[1,2-b][1,3]benzothiazol-11-one SMR000040367 | cid_659353
Type:
Small organic molecule
Emp. Form.:
C16H13NO3S
Mol. Mass.:
299.344
SMILES:
COc1ccc2C3Sc4ccccc4N3C(=O)c2c1OC
: