Target
Isoform 2 of Nuclear receptor ROR-alpha (Alpha-2)
Ligand
BDBM39542
Substrate
Meas. Tech.
Dose-response cell-based assay for activators of the Retinoic Acid Receptor-related orphan receptor A (RORA)
EC50
1750±n/a nM
Citation
 PubChem, PC Dose-response cell-based assay for activators of the Retinoic Acid Receptor-related orphan receptor A (RORA) PubChem Bioassay (2007)[AID] 
Target
Name:
Isoform 2 of Nuclear receptor ROR-alpha (Alpha-2)
Synonyms:
NR1F1 Nuclear receptor ROR-alpha (Alpha-2) RORA RZRA
Type:
PROTEIN
Mol. Mass.:
63033.59
Organism:
Homo sapiens (Human)
Description:
EBI_101591
Residue:
556
  
Inhibitor
Name:
BDBM39542
Synonyms:
MLS000041972 N-[5-(2-methoxyphenyl)-1,3,4-thiadiazol-2-yl]ethanamide cid_665459
Type:
Small organic molecule
Emp. Form.:
C11H11N3O2S
Mol. Mass.:
249.289
SMILES:
COc1ccccc1-c1nnc(NC(C)=O)s1
: