Target
Alkaline phosphatase, germ cell type
Ligand
BDBM39773
Substrate
Meas. Tech.
Luminescent assay for HTS discovery of chemical inhibitors of placental alkaline phosphatase
IC50
11900±1020 nM
Citation
 PubChem, PC Luminescent assay for HTS discovery of chemical inhibitors of placental alkaline phosphatase PubChem Bioassay (2007)[AID] 
Target
Name:
Alkaline phosphatase, germ cell type
Synonyms:
ALPG ALPPL2 PPBN_HUMAN | placental-like alkaline phosphatase preproprotein
Type:
PROTEIN
Mol. Mass.:
57374.31
Organism:
Homo sapiens (Human)
Description:
ChEMBL_29964
Residue:
532
  
Inhibitor
Name:
BDBM39773
Synonyms:
(2Z)-3-ethyl-2-[(1-ethyl-8-methyl-2-quinolin-1-iumyl)methylidene]-1,3-benzothiazole;iodide (2Z)-3-ethyl-2-[(1-ethyl-8-methyl-quinolin-1-ium-2-yl)methylidene]-1,3-benzothiazole;iodide 1-Ethyl-2-(3-ethyl-3H-benzothiazol-2-ylidenemethyl)-8-methyl-quinolinium SMR000177972 | cid_11958727
Type:
Small organic molecule
Emp. Form.:
C22H23N2S
Mol. Mass.:
347.496
SMILES:
CCN1\C(Sc2ccccc12)=C\c1ccc2cccc(C)c2[n+]1CC
: