Target
Estrogen receptor
Ligand
BDBM40218
Substrate
Meas. Tech.
Estrogen Receptor-alpha Coactivator Binding Inhibitors Dose Response Confirmation
IC50
11057.83±n/a nM
Citation
 PubChem, PC Estrogen Receptor-alpha Coactivator Binding Inhibitors Dose Response Confirmation PubChem Bioassay (2007)[AID] 
Target
Name:
Estrogen receptor
Synonyms:
ER ESR ESR1_HUMAN Estrogen receptor Estrogen receptor (ER-alpha) Estrogen receptor alpha (ER) Nuclear receptor subfamily 3 group A member 1
Type:
Protein
Mol. Mass.:
66230.44
Organism:
Homo sapiens (Human)
Description:
P03372
Residue:
595
  
Inhibitor
Name:
BDBM40218
Synonyms:
6-chloranyl-3-[5-(methylamino)-1,3,4-thiadiazol-2-yl]chromen-2-one 6-chloro-3-[5-(methylamino)-1,3,4-thiadiazol-2-yl]-2H-chromen-2-one 6-chloro-3-[5-(methylamino)-1,3,4-thiadiazol-2-yl]coumarin SMR000141826 | cid_1121878
Type:
Small organic molecule
Emp. Form.:
C12H8ClN3O2S
Mol. Mass.:
293.729
SMILES:
CNc1nnc(s1)-c1cc2cc(Cl)ccc2oc1=O
: