Target
fMet-Leu-Phe receptor
Ligand
BDBM40408
Substrate
Meas. Tech.
Formylpeptide Receptor (FPR) Ligand Structure Activity Relationship (SAR) Analysis : Dose Response Assay
Ki
31100±n/a nM
Citation
 PubChem, PC Formylpeptide Receptor (FPR) Ligand Structure Activity Relationship (SAR) Analysis : Dose Response Assay PubChem Bioassay (2007)[AID] 
Target
Name:
fMet-Leu-Phe receptor
Synonyms:
FPR FPR1_HUMAN N-formyl peptide receptor 1 fMLP receptor formyl peptide receptor 1
Type:
Enzyme Catalytic Domain
Mol. Mass.:
38456.14
Organism:
Homo sapiens (Human)
Description:
gi_4503779
Residue:
350
  
Inhibitor
Name:
BDBM40408
Synonyms:
(4E)-1-(3-chlorophenyl)-5-(2,4-dimethoxyphenyl)-4-[hydroxy(phenyl)methylene]pyrrolidine-2,3-quinone (4E)-1-(3-chlorophenyl)-5-(2,4-dimethoxyphenyl)-4-[oxidanyl(phenyl)methylidene]pyrrolidine-2,3-dione cid_5903206
Type:
Small organic molecule
Emp. Form.:
C25H20ClNO5
Mol. Mass.:
449.883
SMILES:
COc1ccc(C2C(C(=O)c3ccccc3)C(=O)C(=O)N2c2cccc(Cl)c2)c(OC)c1
: