Target
fMet-Leu-Phe receptor
Ligand
BDBM40457
Substrate
Meas. Tech.
Formylpeptide Receptor (FPR) Ligand Structure Activity Relationship (SAR) Analysis : Dose Response Assay
Ki
2500±n/a nM
Citation
 PubChem, PC Formylpeptide Receptor (FPR) Ligand Structure Activity Relationship (SAR) Analysis : Dose Response Assay PubChem Bioassay (2007)[AID] 
Target
Name:
fMet-Leu-Phe receptor
Synonyms:
FPR FPR1_HUMAN N-formyl peptide receptor 1 fMLP receptor formyl peptide receptor 1
Type:
Enzyme Catalytic Domain
Mol. Mass.:
38456.14
Organism:
Homo sapiens (Human)
Description:
gi_4503779
Residue:
350
  
Inhibitor
Name:
BDBM40457
Synonyms:
3-(4-chlorophenyl)-5-methyl-6-(phenylmethyl)-2-(trifluoromethyl)-1H-pyrazolo[1,5-a]pyrimidin-7-one CHEMBL522818 cid_2211071
Type:
Small organic molecule
Emp. Form.:
C21H15ClF3N3O
Mol. Mass.:
417.812
SMILES:
Cc1nc2c(c([nH]n2c(=O)c1Cc1ccccc1)C(F)(F)F)-c1ccc(Cl)cc1
: