Target
Estrogen receptor
Ligand
BDBM40531
Substrate
Meas. Tech.
Estrogen Receptor-alpha Coactivator Binding Potentiators Dose Response Confirmation
EC50
6709.28±n/a nM
Citation
 PubChem, PC Estrogen Receptor-alpha Coactivator Binding Potentiators Dose Response Confirmation PubChem Bioassay (2007)[AID] 
Target
Name:
Estrogen receptor
Synonyms:
ER ESR ESR1_HUMAN Estrogen receptor Estrogen receptor (ER-alpha) Estrogen receptor alpha (ER) Nuclear receptor subfamily 3 group A member 1
Type:
Protein
Mol. Mass.:
66230.44
Organism:
Homo sapiens (Human)
Description:
P03372
Residue:
595
  
Inhibitor
Name:
BDBM40531
Synonyms:
5-(4-fluorophenyl)-7-(3-methoxyphenyl)-1,5,6,7-tetrahydro-[1,2,4]triazolo[1,5-a]pyrimidin-2-amine SMR000092227 cid_5308406
Type:
Small organic molecule
Emp. Form.:
C18H18FN5O
Mol. Mass.:
339.3668
SMILES:
COc1cccc(c1)C1CC(Nc2nc(N)nn12)c1ccc(F)cc1
: