Target
Nuclear receptor subfamily 4 group A member 1
Ligand
BDBM40570
Substrate
Meas. Tech.
High Throughput Fluorescence Polarization Screen for Bcl-B Phenotype Converters
IC50
42821±2510 nM
Citation
 PubChem, PC High Throughput Fluorescence Polarization Screen for Bcl-B Phenotype Converters PubChem Bioassay (2008)[AID] 
Target
Name:
Nuclear receptor subfamily 4 group A member 1
Synonyms:
GFRP1 NAK1 NR4A1_HUMAN | nuclear receptor subfamily 4, group A, member 1
Type:
Enzyme Catalytic Domain
Mol. Mass.:
64467.13
Organism:
Homo sapiens (Human)
Description:
gi_27894344
Residue:
598
  
Inhibitor
Name:
BDBM40570
Synonyms:
2-(2-furanyl)-2,3-dihydro-1H-perimidine 2-(furan-2-yl)-2,3-dihydro-1H-perimidine MLS000031215 cid_647027
Type:
Small organic molecule
Emp. Form.:
C15H12N2O
Mol. Mass.:
236.2686
SMILES:
N1C(Nc2cccc3cccc1c23)c1ccco1
: