Target
N-formyl peptide receptor 2
Ligand
BDBM40749
Substrate
Meas. Tech.
Formylpeptide Receptor (FPRL1) Ligand Structure Activity Relationship (SAR) Analysis : Dose Response Assay
IC50
10700±n/a nM
Citation
 PubChem, PC Formylpeptide Receptor (FPRL1) Ligand Structure Activity Relationship (SAR) Analysis : Dose Response Assay PubChem Bioassay (2007)[AID] 
Target
Name:
N-formyl peptide receptor 2
Synonyms:
ALXR, FPRL1, FPR2 FPR2 FPRH1 Formyl Peptide Receptor-Like 1 LXA4 receptor Lipoxin A4 receptor RFP | hFPRL
Type:
G Protein-Coupled Receptor (GPCR)
Mol. Mass.:
38968.35
Organism:
Homo sapiens (Human)
Description:
P25090
Residue:
351
  
Inhibitor
Name:
BDBM40749
Synonyms:
N-(5-imidazo[1,2-a]pyrimidin-2-yl-2-methoxy-phenyl)propanamide N-(5-imidazo[1,2-a]pyrimidin-2-yl-2-methoxyphenyl)propanamide UNM000003657601 | cid_7080248
Type:
Small organic molecule
Emp. Form.:
C16H16N4O2
Mol. Mass.:
296.3238
SMILES:
CCC(=O)Nc1cc(ccc1OC)-c1cn2cccnc2n1
: