Target
Serine/threonine-protein phosphatase 2A activator
Ligand
BDBM40780
Substrate
Meas. Tech.
Inhibition Assay
IC50
2.1±n/a nM
Citation
 Wakimoto, TMatsunaga, STakai, AFusetani, N Insight into binding of calyculin A to protein phosphatase 1: isolation of hemicalyculin a and chemical transformation of calyculin A. Chem Biol 9:309-19 (2002)  
Target
Name:
Serine/threonine-protein phosphatase 2A activator
Synonyms:
5.2.1.8 PTPA Phosphotyrosyl phosphatase activator Protein phosphatase 2A regulatory subunit B' Serine/threonine-protein phosphatase 2A regulatory subunit 4
Type:
Mol. Mass.:
40662.53
Organism:
Homo sapiens (Human)
Description:
Q15257
Residue:
358
  
Inhibitor
Name:
BDBM40780
Synonyms:
Calyculin A 21-acetate (13)
Type:
Small organic molecule
Emp. Form.:
C52H83N4O16P
Mol. Mass.:
1051.2064
SMILES:
COC[C@@H](C(O)[C@H](O)C(=O)NCCC(C)c1nc(\C=C\CC2OC3(C[C@@H](OC(C)=O)[C@@H]2C)O[C@H]([C@H](C[C@H](O)C(C)[C@H](O)C(C)\C=C(/C)\C(\C)=C\C=C\C(\C)=C\C#N)OC)[C@H](OP(O)(O)=O)C3(C)C)co1)N(C)C
: