Target
Focal adhesion kinase 1
Ligand
BDBM22857
Substrate
Meas. Tech.
Dose-response biochemical assay for inhibitors of Focal Adhesion Kinase (FAK)
IC50
>70000±n/a nM
Citation
 PubChem, PC Dose-response biochemical assay for inhibitors of Focal Adhesion Kinase (FAK) PubChem Bioassay (2007)[AID] 
Target
Name:
Focal adhesion kinase 1
Synonyms:
FADK 1 FAK1 FLT4 Focal adhesion kinase (FAK) Focal adhesion kinase 1 (FAK) Focal adhesion kinase-related nonkinase PTK2 Protein-tyrosine kinase 2 p125FAK | pp125FAK
Type:
Tyrosine-protein kinase
Mol. Mass.:
119233.17
Organism:
Homo sapiens (Human)
Description:
Q05397
Residue:
1052
  
Inhibitor
Name:
BDBM22857
Synonyms:
1,2-Dione-Based Compound, 14 CHEMBL51931 cid_6763
Type:
Small organic molecule
Emp. Form.:
C14H8O2
Mol. Mass.:
208.2121
SMILES:
O=C1C(=O)c2ccccc2-c2ccccc12
: