Target
DNA-directed RNA polymerase subunit beta
Ligand
BDBM40570
Substrate
Meas. Tech.
RNA polymerase dose-response confirmation
IC50
>50000±0 nM
Citation
 PubChem, PC RNA polymerase dose-response confirmation PubChem Bioassay (2008)[AID] 
Target
Name:
DNA-directed RNA polymerase subunit beta
Synonyms:
RNA polymerase beta subunit (EC 2.7.7.6)
Type:
Enzyme Catalytic Domain
Mol. Mass.:
150595.80
Organism:
Escherichia coli
Description:
A0A0E2LB94
Residue:
1342
  
Inhibitor
Name:
BDBM40570
Synonyms:
2-(2-furanyl)-2,3-dihydro-1H-perimidine 2-(furan-2-yl)-2,3-dihydro-1H-perimidine MLS000031215 cid_647027
Type:
Small organic molecule
Emp. Form.:
C15H12N2O
Mol. Mass.:
236.2686
SMILES:
N1C(Nc2cccc3cccc1c23)c1ccco1
: