Target
Galanin receptor type 2
Ligand
BDBM50004233
Substrate
Meas. Tech.
Dose Response cell-based high-throughput screening assay to identify agonists of galanin receptor 2 (GALR2)
EC50
>55700±n/a nM
Citation
 PubChem, PC Dose Response cell-based high-throughput screening assay to identify agonists of galanin receptor 2 (GALR2) PubChem Bioassay (2008)[AID] 
Target
Name:
Galanin receptor type 2
Synonyms:
GALNR2 GALR2_HUMAN Galanin receptor 2 Galanin receptor type 2 (GAL2-R) (GALR2).
Type:
Enzyme Catalytic Domain
Mol. Mass.:
41724.40
Organism:
Homo sapiens (Human)
Description:
Galanin R2 GALR2 HUMAN::O43603
Residue:
387
  
Inhibitor
Name:
BDBM50004233
Synonyms:
5,11-dimethyl-2H-pyrido[4,3-b]carbazole ELLIPTECINE Ellipticine cid_3213
Type:
Small organic molecule
Emp. Form.:
C17H14N2
Mol. Mass.:
246.3065
SMILES:
Cc1c2[nH]c3ccccc3c2c(C)c2cnccc12
: