Target
Gag-Pol polyprotein [588-1027]/[588-1147]
Ligand
BDBM1902
Substrate
(rC)n.(dG)12-18
Meas. Tech.
HIV-1 RT Assay
IC50
30±n/a nM
Citation
 Bell, FWCantrell, ASHogberg, MJaskunas, SRJohansson, NGJordan, CLKinnick, MDLind, PMorin, JMNoreen, R Phenethylthiazolethiourea (PETT) compounds, a new class of HIV-1 reverse transcriptase inhibitors. 1. Synthesis and basic structure-activity relationship studies of PETT analogs. J Med Chem 38:4929-36 (1995)  
Target
Name:
Gag-Pol polyprotein [588-1027]/[588-1147]
Synonyms:
EC: 2.7.7.49 | HIV-1 Reverse Transcriptase
Type:
Protein Complex
Mol. Mass.:
115684
Description:
Components:
This complex has 2 components.
Component 1
Name:
Gag-Pol polyprotein [588-1147]
Synonyms:
HIV-1 Reverse Transcriptase Chain A gag-pol
Type:
Enzyme Subunit
Mol. Mass.:
64486.41
Organism:
Human immunodeficiency virus type 1
Description:
P04585[588-1147]
Residue:
560
  
Component 2
Name:
Gag-Pol polyprotein [588-1027]
Synonyms:
HIV-1 Reverse Transcriptase Chain B gag-pol
Type:
Enzyme Subunit
Mol. Mass.:
51337.13
Organism:
Human immunodeficiency virus type 1
Description:
P04585[588-1027]
Residue:
440
  
Inhibitor
Name:
BDBM1902
Synonyms:
1-[2-(2-azidophenyl)ethyl]-3-1,3-thiazol-2-ylthiourea PETT Analog 9
Type:
Small organic molecule
Emp. Form.:
C12H12N6S2
Mol. Mass.:
304.394
SMILES:
[N-]=[N+]=Nc1ccccc1CCNC(=S)Nc1nccs1
:
Substrate
Name:
(rC)n.(dG)12-18
Synonyms:
Type:
RNA-DNA duplex
Mol. Mass.:
358.43
Organism:
Description:
The incorporation of Tritium-labeled dGTP onto a poly(rC):oligo(dG)template:primer.
Residue:
3
NA