Target
Lysosomal acid glucosylceramidase
Ligand
BDBM42271
Substrate
Meas. Tech.
Dose response cell-based high throughput screening assay to identify enhancers of beta-glucosidase activity
EC50
>50000±n/a nM
Citation
 PubChem, PC Dose response cell-based high throughput screening assay to identify enhancers of beta-glucosidase activity PubChem Bioassay (2008)[AID] 
Target
Name:
Lysosomal acid glucosylceramidase
Synonyms:
Acid beta-glucosidase Beta-glucocerebrosidase D-glucosyl-N-acylsphingosine glucohydrolase GBA1 GC GLUC Glucosylceramidase (GBA) Glucosylceramidase precursor (Beta-glucocerebrosidase) (Acid beta-glucosidase) (D-glucosyl-N-acylsphingosine glucohydrolase) (Alglucerase) (Imiglucerase) beta-glucocerebrosidase (GCase)
Type:
Enzyme
Mol. Mass.:
59724.64
Organism:
Homo sapiens (Human)
Description:
The beta-Glu activity was measured with commercially available beta-glucocerebrosidase (Ceredase) as the enzyme source.
Residue:
536
  
Inhibitor
Name:
BDBM42271
Synonyms:
(2',4'-Dimethyl-[4,5']bithiazolyl-2-yl)-furan-2-ylmethyl-amine 4-(2,4-dimethyl-5-thiazolyl)-N-(2-furanylmethyl)-2-thiazolamine SMR000011632 cid_646758
Type:
Small organic molecule
Emp. Form.:
C13H13N3OS2
Mol. Mass.:
291.392
SMILES:
Cc1nc(C)c(s1)-c1csc(NCc2ccco2)n1
: